Target
Thymidylate synthase
Ligand
BDBM50037303
Substrate
Meas. Tech.
ChEMBL_209959 (CHEMBL820615)
IC50
2±n/a nM
Citation
 Bisset, GMBavetsias, VThornton, TJPawelczak, KCalvert, AHHughes, LRJackman, AL The synthesis and thymidylate synthase inhibitory activity of L-gamma-L-linked dipeptide and L-gamma-amide analogues of 2-desamino-2-methyl-N10-propargyl-5,8-dideazafolic acid (ICI 198583). J Med Chem 37:3294-302 (1994)  
Target
Name:
Thymidylate synthase
Synonyms:
TS TYSY_MOUSE | Tyms
Type:
PROTEIN
Mol. Mass.:
34957.15
Organism:
Mus musculus
Description:
ChEMBL_1340097
Residue:
307
  
Inhibitor
Name:
BDBM50037303
Synonyms:
(R)-2-((R)-4-Carboxy-4-{4-[(2-methyl-4-oxo-3,4-dihydro-quinazolin-6-ylmethyl)-prop-2-ynyl-amino]-benzoylamino}-butyrylamino)-pentanedioic acid CHEMBL320794
Type:
Small organic molecule
Emp. Form.:
C30H31N5O9
Mol. Mass.:
605.5952
SMILES:
Cc1nc2ccc(CN(CC#C)c3ccc(cc3)C(=O)N[C@H](CCC(=O)N[C@H](CCC(O)=O)C(O)=O)C(O)=O)cc2c(=O)[nH]1
: