Target
Glyceraldehyde-3-phosphate dehydrogenase
Ligand
BDBM50030947
Substrate
Meas. Tech.
ChEMBL_72880 (CHEMBL684048)
IC50
300±n/a nM
Citation
 Verlinde, CLCallens, MVan Calenbergh, SVan Aerschot, AHerdewijn, PHannaert, VMichels, PAOpperdoes, FRHol, WG Selective inhibition of trypanosomal glyceraldehyde-3-phosphate dehydrogenase by protein structure-based design: toward new drugs for the treatment of sleeping sickness. J Med Chem 37:3605-13 (1994)  
Target
Name:
Glyceraldehyde-3-phosphate dehydrogenase
Synonyms:
G3P_HUMAN GAPDH glyceraldehyde-3-phosphate dehydrogenase
Type:
PROTEIN
Mol. Mass.:
36060.86
Organism:
Homo sapiens (Human)
Description:
ChEMBL_1511315
Residue:
335
  
Inhibitor
Name:
BDBM50030947
Synonyms:
CHEMBL331845 | N-[2-(6-Amino-purin-9-yl)-4-hydroxy-5-hydroxymethyl-tetrahydro-furan-3-yl]-3-methoxy-benzamide
Type:
Small organic molecule
Emp. Form.:
C18H20N6O5
Mol. Mass.:
400.3886
SMILES:
COc1cccc(c1)C(=O)NC1C(O)C(CO)OC1n1cnc2c(N)ncnc12
: