Target
Glyceraldehyde-3-phosphate dehydrogenase
Ligand
BDBM50030949
Substrate
Meas. Tech.
ChEMBL_72902 (CHEMBL684096)
IC50
1300±n/a nM
Citation
 Verlinde, CLCallens, MVan Calenbergh, SVan Aerschot, AHerdewijn, PHannaert, VMichels, PAOpperdoes, FRHol, WG Selective inhibition of trypanosomal glyceraldehyde-3-phosphate dehydrogenase by protein structure-based design: toward new drugs for the treatment of sleeping sickness. J Med Chem 37:3605-13 (1994)  
Target
Name:
Glyceraldehyde-3-phosphate dehydrogenase
Synonyms:
G3P_HUMAN GAPDH glyceraldehyde-3-phosphate dehydrogenase
Type:
PROTEIN
Mol. Mass.:
36060.86
Organism:
Homo sapiens (Human)
Description:
ChEMBL_1511315
Residue:
335
  
Inhibitor
Name:
BDBM50030949
Synonyms:
(2R,3R,4S,5R)-2-(6-Amino-8-thiophen-2-yl-purin-9-yl)-5-hydroxymethyl-tetrahydro-furan-3,4-diol | CHEMBL124807
Type:
Small organic molecule
Emp. Form.:
C14H15N5O4S
Mol. Mass.:
349.365
SMILES:
Nc1ncnc2n([C@@H]3O[C@H](CO)[C@@H](O)[C@H]3O)c(nc12)-c1cccs1
: