Target
Adenosine receptor A1
Ligand
BDBM50453508
Substrate
Meas. Tech.
ChEMBL_29165 (CHEMBL637896)
Ki
110±n/a nM
Citation
 Güngör, TMalabre, PTeulon, JMCamborde, FMeignen, JHertz, FVirone-Oddos, ACaussade, FCloarec, A N6-substituted adenosine receptor agonists. Synthesis and pharmacological activity as potent antinociceptive agents. J Med Chem 37:4307-16 (1995)  
Target
Name:
Adenosine receptor A1
Synonyms:
AA1R_RAT ADENOSINE A1 high Adenosine A1 receptor (A1) Adenosine receptors A1 | Adora1
Type:
Protein
Mol. Mass.:
36704.13
Organism:
Rattus norvegicus (rat)
Description:
Residue:
326
  
Inhibitor
Name:
BDBM50453508
Synonyms:
CHEMBL2113585
Type:
Small organic molecule
Emp. Form.:
C28H33N7O4
Mol. Mass.:
531.6061
SMILES:
O[C@H]1[C@@H](O)[C@@H](O[C@@H]1C(=O)NC1CC1)n1cnc2c(NCCc3cn(C4CCCC4)c4ccccc34)ncnc12
: