Target
5-hydroxytryptamine receptor 1A
Ligand
BDBM50035518
Substrate
Meas. Tech.
ChEMBL_1412 (CHEMBL616200)
Ki
9.3±n/a nM
Citation
 Zhuang, ZPKung, MPChumpradit, SMu, MKung, HF Derivatives of 4-(2'-methoxyphenyl)-1-[2'-(N-2"-pyridinyl-p-iodobenzamido)ethyl]pipera zine (p-MPPI) as 5-HT1A ligands. J Med Chem 37:4572-5 (1995)  
Target
Name:
5-hydroxytryptamine receptor 1A
Synonyms:
5-HT-1A 5-HT1A 5-hydroxytryptamine receptor 1A (5HT1A) 5ht1a Htr1a Serotonin 1a (5-HT1a) receptor/Adrenergic receptor alpha-1 | Serotonin receptor 1A
Type:
G Protein-Coupled Receptor (GPCR)
Mol. Mass.:
46445.29
Organism:
Rattus norvegicus (rat)
Description:
Binding assays were performed using rat hippocampal membranes.
Residue:
422
  
Inhibitor
Name:
BDBM50035518
Synonyms:
4-Ethyl-N-{2-[4-(2-methoxy-phenyl)-piperazin-1-yl]-ethyl}-N-pyridin-2-yl-benzamide | CHEMBL343310
Type:
Small organic molecule
Emp. Form.:
C27H32N4O2
Mol. Mass.:
444.5686
SMILES:
CCc1ccc(cc1)C(=O)N(CCN1CCN(CC1)c1ccccc1OC)c1ccccn1
: