Target
Renin
Ligand
BDBM50040393
Substrate
Meas. Tech.
ChEMBL_195938 (CHEMBL801664)
IC50
20±n/a nM
Citation
 Raddatz, PMinck, KORippmann, FSchmitges, CJ Non-peptide renin inhibitors containing 2-(((3-phenylpropyl)phosphoryl)oxy)alkanoic acid moieties as P2-P3 replacements. J Med Chem 37:486-97 (1994)  
Target
Name:
Renin
Synonyms:
Angiotensinogenase RENI_HUMAN
Type:
Enzyme
Mol. Mass.:
45058.99
Organism:
Homo sapiens (Human)
Description:
Residue:
406
  
Inhibitor
Name:
BDBM50040393
Synonyms:
(3-Phenyl-propyl)-phosphonic acid (R)-1-((1S,2R,3S)-1-cyclohexylmethyl-3-cyclopropyl-2,3-dihydroxy-propylcarbamoyl)-butyl ester ethyl ester | CHEMBL144812
Type:
Small organic molecule
Emp. Form.:
C29H48NO6P
Mol. Mass.:
537.6683
SMILES:
CCC[C@@H](OP(=O)(CCCc1ccccc1)OCC)C(=O)N[C@@H](CC1CCCCC1)[C@@H](O)[C@@H](O)C1CC1
: