Target
Renin
Ligand
BDBM50040383
Substrate
Meas. Tech.
ChEMBL_195938 (CHEMBL801664)
IC50
4.2±n/a nM
Citation
 Raddatz, PMinck, KORippmann, FSchmitges, CJ Non-peptide renin inhibitors containing 2-(((3-phenylpropyl)phosphoryl)oxy)alkanoic acid moieties as P2-P3 replacements. J Med Chem 37:486-97 (1994)  
Target
Name:
Renin
Synonyms:
Angiotensinogenase RENI_HUMAN
Type:
Enzyme
Mol. Mass.:
45058.99
Organism:
Homo sapiens (Human)
Description:
Residue:
406
  
Inhibitor
Name:
BDBM50040383
Synonyms:
(3-Phenyl-propyl)-phosphonic acid mono-[(S)-1-((1S,2S,4R)-4-butylcarbamoyl-1-cyclohexylmethyl-2-hydroxy-pentylcarbamoyl)-butyl] ester | CHEMBL356144
Type:
Small organic molecule
Emp. Form.:
C31H53N2O6P
Mol. Mass.:
580.7361
SMILES:
CCCCNC(=O)[C@H](C)C[C@H](O)[C@H](CC1CCCCC1)NC(=O)[C@H](CCC)OP(O)(=O)CCCc1ccccc1
: