Target
Delta-type opioid receptor
Ligand
BDBM50040487
Substrate
Meas. Tech.
ChEMBL_145065 (CHEMBL753996)
Ki
0.047000±n/a nM
Citation
 Portoghese, PSSultana, MMoe, STTakemori, AE Synthesis of naltrexone-derived delta-opioid antagonists. Role of conformation of the delta address moiety. J Med Chem 37:579-85 (1994)  
Target
Name:
Delta-type opioid receptor
Synonyms:
Cytochrome P450 3A4 Delta opioid receptor Delta-type opioid receptor (DOR) OPRD_RAT Opioid receptor Opioid receptors; mu & delta Ror-a | Voltage-gated potassium channel
Type:
G Protein-Coupled Receptor (GPCR)
Mol. Mass.:
40465.04
Organism:
Rattus norvegicus (rat)
Description:
Competition binding assays were using CHO-K1 cell membranes expressing the opioid receptor.
Residue:
372
  
Inhibitor
Name:
BDBM50040487
Synonyms:
17-(cyclopropylmethyl)4,5-alpha-epoxy-3,14-dihydroxymorphinan-6-one-7-spiro-2'-indan
Type:
Small organic molecule
Emp. Form.:
C28H29NO4
Mol. Mass.:
443.5342
SMILES:
Oc1ccc2CC3N(CC4CC4)CC[C@@]45[C@@H](Oc1c24)C(=O)C1(Cc2ccccc2C1)C[C@@]35O
: