Target
Neuraminidase
Ligand
BDBM50040515
Substrate
Meas. Tech.
ChEMBL_200797 (CHEMBL808321)
Ki
40±n/a nM
Citation
 Taylor, NRvon Itzstein, M Molecular modeling studies on ligand binding to sialidase from influenza virus and the mechanism of catalysis. J Med Chem 37:616-24 (1994)  
Target
Name:
Neuraminidase
Synonyms:
Influenza A Virus Neuraminidase NRAM_I34A1 Neuraminidase A
Type:
Enzyme
Mol. Mass.:
50124.14
Organism:
Influenza A virus (A/Puerto Rico/8/34/Mount Sinai(H1N1))
Description:
P03468
Residue:
454
  
Inhibitor
Name:
BDBM50040515
Synonyms:
3-(acetylamino)-4-ammonio-2-[(1R,2R)-1,2,3-trihydroxypropyl]-3,4-dihydro-2H-pyran-6-carboxylate | CHEMBL345693
Type:
Small organic molecule
Emp. Form.:
C11H18N2O7
Mol. Mass.:
290.2698
SMILES:
CC(=O)NC1C([NH3+])C=C(OC1[C@H](O)[C@H](O)CO)C([O-])=O
: