Target
Gastrin/cholecystokinin type B receptor
Ligand
BDBM50007925
Substrate
Meas. Tech.
ChEMBL_47953 (CHEMBL656242)
IC50
1400±n/a nM
Citation
 Holladay, MWKopecka, HMiller, TRBednarz, LNikkel, ALBianchi, BRWitte, DGShiosaki, KLin, CWAsin, KE Tetrapeptide CCK-A agonists: effect of backbone N-methylations on in vitro and in vivo CCK activity. J Med Chem 37:630-5 (1994)  
Target
Name:
Gastrin/cholecystokinin type B receptor
Synonyms:
CCK-2 receptor CCK-BR CCKRB Cholecystokinin receptor GASR_HUMAN | Gastrin/cholecystokinin type B receptor
Type:
G Protein-Coupled Receptor (GPCR)
Mol. Mass.:
48445.79
Organism:
Homo sapiens (Human)
Description:
Stable expression of human CCK-2 receptors in HEK 293 cells.
Residue:
447
  
Inhibitor
Name:
BDBM50007925
Synonyms:
(S)-3-[(S)-2-[(S)-2-tert-Butoxycarbonylamino-3-(1H-indol-3-yl)-propionylamino]-6-(3-o-tolyl-ureido)-hexanoylamino]-N-((S)-1-carbamoyl-2-phenyl-ethyl)-succinamic acid CHEMBL320868
Type:
Small organic molecule
Emp. Form.:
C43H54N8O9
Mol. Mass.:
826.9371
SMILES:
Cc1ccccc1NC(=O)NCCCC[C@H](NC(=O)[C@H](Cc1c[nH]c2ccccc12)NC(=O)OC(C)(C)C)C(=O)N[C@@H](CC(O)=O)C(=O)N[C@@H](Cc1ccccc1)C(N)=O
: