Target
Adenosine receptor A1
Ligand
BDBM50453546
Substrate
Meas. Tech.
ChEMBL_29150 (CHEMBL639430)
Ki
22±n/a nM
Citation
 Gallo-Rodriguez, CJi, XDMelman, NSiegman, BDSanders, LHOrlina, JFischer, BPu, QOlah, MEvan Galen, PJ Structure-activity relationships of N6-benzyladenosine-5'-uronamides as A3-selective adenosine agonists. J Med Chem 37:636-46 (1994)  
Target
Name:
Adenosine receptor A1
Synonyms:
AA1R_RAT ADENOSINE A1 high Adenosine A1 receptor (A1) Adenosine receptors A1 | Adora1
Type:
Protein
Mol. Mass.:
36704.13
Organism:
Rattus norvegicus (rat)
Description:
Residue:
326
  
Inhibitor
Name:
BDBM50453546
Synonyms:
CHEMBL2113565
Type:
Small organic molecule
Emp. Form.:
C19H21ClN6O4
Mol. Mass.:
432.861
SMILES:
CCNC(=O)[C@H]1O[C@H]([C@H](O)[C@@H]1O)n1cnc2c(NCc3cccc(Cl)c3)ncnc12
: