Target
Adenosine receptor A3
Ligand
BDBM50453540
Substrate
Meas. Tech.
ChEMBL_30471 (CHEMBL643132)
Ki
11±n/a nM
Citation
 Gallo-Rodriguez, CJi, XDMelman, NSiegman, BDSanders, LHOrlina, JFischer, BPu, QOlah, MEvan Galen, PJ Structure-activity relationships of N6-benzyladenosine-5'-uronamides as A3-selective adenosine agonists. J Med Chem 37:636-46 (1994)  
Target
Name:
Adenosine receptor A3
Synonyms:
AA3R_RAT Adenosine receptor A2a and A3 | Adora3
Type:
PROTEIN
Mol. Mass.:
36643.73
Organism:
Rattus norvegicus
Description:
ChEMBL_479910
Residue:
320
  
Inhibitor
Name:
BDBM50453540
Synonyms:
CHEMBL2113610
Type:
Small organic molecule
Emp. Form.:
C20H24N6O5
Mol. Mass.:
428.4418
SMILES:
CCNC(=O)[C@H]1O[C@H]([C@H](O)[C@@H]1O)n1cnc2c(NCc3ccc(OC)cc3)ncnc12
: