Target
Gastrin/cholecystokinin type B receptor
Ligand
BDBM50040667
Substrate
Meas. Tech.
ChEMBL_47969 (CHEMBL657472)
IC50
0.10±n/a nM
Citation
 Showell, GABourrain, SNeduvelil, JGFletcher, SRBaker, RWatt, APFletcher, AEFreedman, SBKemp, JAMarshall, GR High-affinity and potent, water-soluble 5-amino-1,4-benzodiazepine CCKB/gastrin receptor antagonists containing a cationic solubilizing group. J Med Chem 37:719-21 (1994)  
Target
Name:
Gastrin/cholecystokinin type B receptor
Synonyms:
CCK-2 receptor CCK-BR CCKRB Cholecystokinin receptor GASR_HUMAN | Gastrin/cholecystokinin type B receptor
Type:
G Protein-Coupled Receptor (GPCR)
Mol. Mass.:
48445.79
Organism:
Homo sapiens (Human)
Description:
Stable expression of human CCK-2 receptors in HEK 293 cells.
Residue:
447
  
Inhibitor
Name:
BDBM50040667
Synonyms:
1-[(R)-5-(3-Aza-bicyclo[3.2.2]non-3-yl)-1-methyl-2-oxo-2,3-dihydro-1H-benzo[e][1,4]diazepin-3-yl]-3-m-tolyl-urea; hydrochloride | CHEMBL545122
Type:
Small organic molecule
Emp. Form.:
C26H31N5O2
Mol. Mass.:
445.5566
SMILES:
CN1c2ccccc2C(=N[C@@H](NC(=O)Nc2cccc(C)c2)C1=O)N1CC2CCC(CC2)C1
: