Target
Gag-Pol polyprotein [489-587]
Ligand
BDBM50041043
Substrate
Meas. Tech.
ChEMBL_157567 (CHEMBL763318)
Ki
0.090000±n/a nM
Citation
 Greer, JErickson, JWBaldwin, JJVarney, MD Application of the three-dimensional structures of protein target molecules in structure-based drug design. J Med Chem 37:1035-54 (1994)  
Target
Name:
Gag-Pol polyprotein [489-587]
Synonyms:
Human immunodeficiency virus type 1 protease Pol polyprotein | gag-pol
Type:
Enzyme Subunit
Mol. Mass.:
10781.16
Organism:
Human immunodeficiency virus type 1
Description:
P04585[489-587]
Residue:
99
  
Inhibitor
Name:
BDBM50041043
Synonyms:
(1-{(1S,2S,3R,4S)-1-Benzyl-2,3-dihydroxy-4-[3-methyl-2-(pyridin-2-ylmethoxycarbonylamino)-butyrylamino]-5-phenyl-pentylcarbamoyl}-2-methyl-propyl)-carbamic acid pyridin-2-ylmethyl ester | CHEMBL269373
Type:
Small organic molecule
Emp. Form.:
C42H52N6O8
Mol. Mass.:
768.8977
SMILES:
CC(C)C(NC(=O)OCc1ccccn1)C(=O)N[C@@H](Cc1ccccc1)[C@H](O)[C@H](O)[C@H](Cc1ccccc1)NC(=O)C(NC(=O)OCc1ccccn1)C(C)C
: