Target
Gag-Pol polyprotein [489-587]
Ligand
BDBM50041030
Substrate
Meas. Tech.
ChEMBL_159300 (CHEMBL769406)
IC50
0.38±n/a nM
Citation
 Greer, JErickson, JWBaldwin, JJVarney, MD Application of the three-dimensional structures of protein target molecules in structure-based drug design. J Med Chem 37:1035-54 (1994)  
Target
Name:
Gag-Pol polyprotein [489-587]
Synonyms:
Human immunodeficiency virus type 1 protease Pol polyprotein | gag-pol
Type:
Enzyme Subunit
Mol. Mass.:
10781.16
Organism:
Human immunodeficiency virus type 1
Description:
P04585[489-587]
Residue:
99
  
Inhibitor
Name:
BDBM50041030
Synonyms:
CHEMBL429722 | {1-[(1S,2R,3R,4S)-1-Benzyl-4-(2-benzyloxycarbonylamino-3-methyl-butyrylamino)-2,3-dihydroxy-5-phenyl-pentylcarbamoyl]-2-methyl-propyl}-carbamic acid benzyl ester
Type:
Small organic molecule
Emp. Form.:
C44H54N4O8
Mol. Mass.:
766.9216
SMILES:
CC(C)C(NC(=O)OCc1ccccc1)C(=O)N[C@@H](Cc1ccccc1)[C@@H](O)[C@H](O)[C@H](Cc1ccccc1)NC(=O)C(NC(=O)OCc1ccccc1)C(C)C
: