Target
Gag-Pol polyprotein [489-587]
Ligand
BDBM50014153
Substrate
Meas. Tech.
ChEMBL_159300 (CHEMBL769406)
IC50
40±n/a nM
Citation
 Greer, JErickson, JWBaldwin, JJVarney, MD Application of the three-dimensional structures of protein target molecules in structure-based drug design. J Med Chem 37:1035-54 (1994)  
Target
Name:
Gag-Pol polyprotein [489-587]
Synonyms:
Human immunodeficiency virus type 1 protease Pol polyprotein | gag-pol
Type:
Enzyme Subunit
Mol. Mass.:
10781.16
Organism:
Human immunodeficiency virus type 1
Description:
P04585[489-587]
Residue:
99
  
Inhibitor
Name:
BDBM50014153
Synonyms:
((1S,2S,3S,4S)-1-Benzyl-4-tert-butoxycarbonylamino-2,3-dihydroxy-5-phenyl-pentyl)-carbamic acid tert-butyl ester di-tert-butyl ((2S,3S,4S,5S)-3,4-dihydroxy-1,6-diphenylhexane-2,5-diyl)dicarbamate
Type:
Small organic molecule
Emp. Form.:
C28H40N2O6
Mol. Mass.:
500.627
SMILES:
CC(C)(C)OC(=O)N[C@@H](Cc1ccccc1)[C@H](O)[C@@H](O)[C@H](Cc1ccccc1)NC(=O)OC(C)(C)C
: