Target
Carbonic anhydrase 2
Ligand
BDBM50041038
Substrate
Meas. Tech.
ChEMBL_45062 (CHEMBL658729)
Ki
140±n/a nM
Citation
 Greer, JErickson, JWBaldwin, JJVarney, MD Application of the three-dimensional structures of protein target molecules in structure-based drug design. J Med Chem 37:1035-54 (1994)  
Target
Name:
Carbonic anhydrase 2
Synonyms:
CA-II CAC Carbonate dehydratase II Carbonic anhydrase 2 (CA-II) Carbonic anhydrase C Carbonic anhydrase II (CA-II) Carbonic anhydrase II (hCA II) | Carbonic anhydrase isoenzyme II (hCA II)
Type:
Enzyme
Mol. Mass.:
29250.71
Organism:
Homo sapiens (Human)
Description:
P00918
Residue:
260
  
Inhibitor
Name:
BDBM50041038
Synonyms:
(S)-N-{(1S,2R,3S,4S)-1-Benzyl-2,3-dihydroxy-4-[(S)-3-methyl-2-(3-methyl-3-pyridin-2-ylmethyl-ureido)-butyrylamino]-5-phenyl-pentyl}-3-methyl-2-(3-methyl-3-pyridin-2-ylmethyl-ureido)-butyramide CHEMBL266918 N-{(1S,2S,3R,4S)-1-Benzyl-2,3-dihydroxy-4-[3-methyl-2-(3-methyl-3-pyridin-2-ylmethyl-ureido)-butyrylamino]-5-phenyl-pentyl}-3-methyl-2-(3-methyl-3-pyridin-2-ylmethyl-ureido)-butyramide
Type:
Small organic molecule
Emp. Form.:
C44H58N8O6
Mol. Mass.:
794.9813
SMILES:
CC(C)C(NC(=O)N(C)Cc1ccccn1)C(=O)N[C@@H](Cc1ccccc1)[C@H](O)[C@H](O)[C@H](Cc1ccccc1)NC(=O)C(NC(=O)N(C)Cc1ccccn1)C(C)C
: