Target
Carbonic anhydrase 2
Ligand
BDBM50041045
Substrate
Meas. Tech.
ChEMBL_45062 (CHEMBL658729)
Ki
0.14±n/a nM
Citation
 Greer, JErickson, JWBaldwin, JJVarney, MD Application of the three-dimensional structures of protein target molecules in structure-based drug design. J Med Chem 37:1035-54 (1994)  
Target
Name:
Carbonic anhydrase 2
Synonyms:
CA-II CAC Carbonate dehydratase II Carbonic anhydrase 2 (CA-II) Carbonic anhydrase C Carbonic anhydrase II (CA-II) Carbonic anhydrase II (hCA II) | Carbonic anhydrase isoenzyme II (hCA II)
Type:
Enzyme
Mol. Mass.:
29250.71
Organism:
Homo sapiens (Human)
Description:
P00918
Residue:
260
  
Inhibitor
Name:
BDBM50041045
Synonyms:
(4S,6S)-4-Ethylamino-7,7-dioxo-6-propyl-4,5,6,7-tetrahydro-7lambda*6*-thieno[2,3-b]thiopyran-2-sulfonic acid amide | CHEMBL273599
Type:
Small organic molecule
Emp. Form.:
C12H20N2O4S3
Mol. Mass.:
352.493
SMILES:
CCC[C@H]1C[C@H](NCC)c2cc(sc2S1(=O)=O)S(N)(=O)=O
: