Target
Aminopeptidase N
Ligand
BDBM50036832
Substrate
Meas. Tech.
ChEMBL_35505 (CHEMBL646415)
IC50
500000±n/a nM
Citation
 Chauvel, ENCoric, PLlorens-Cortès, CWilk, SRoques, BPFournié-Zaluski, MC Investigation of the active site of aminopeptidase A using a series of new thiol-containing inhibitors. J Med Chem 37:1339-46 (1994)  
Target
Name:
Aminopeptidase N
Synonyms:
AMPN_HUMAN APN Aminopeptidase CD_antigen=CD13 Myeloid plasma membrane glycoprotein CD13 gp150 | hAPN
Type:
PROTEIN
Mol. Mass.:
109522.63
Organism:
Homo sapiens (Human)
Description:
ChEMBL_1507526
Residue:
967
  
Inhibitor
Name:
BDBM50036832
Synonyms:
(2-Amino-3-phenyl-propyl)-phosphonic acid CHEMBL26845
Type:
Small organic molecule
Emp. Form.:
C9H14NO3P
Mol. Mass.:
215.1861
SMILES:
NC(Cc1ccccc1)CP(O)(O)=O
: