Target
Integrin alpha-IIb/beta-3
Ligand
BDBM50035970
Substrate
Meas. Tech.
ChEMBL_70172 (CHEMBL683543)
IC50
9000±n/a nM
Citation
 Sanfilippo, PJUrbanski, MJBeers, KNEckardt, AFalotico, RGinsberg, MHOfford, SPress, JBTighe, JTomko, K Novel thiazole-based heterocycles as selective inhibitors of fibrinogen-mediated platelet aggregation. J Med Chem 38:34-41 (1995)  
Target
Name:
Integrin alpha-IIb/beta-3
Synonyms:
Glycoprotein IIb/IIIa
Type:
Mol. Mass.:
Description:
ASSAY_ID of EBI is 30109
Components:
This complex has 2 components.
Component 1
Name:
Integrin beta-3
Synonyms:
CD_antigen=CD61 GPIIIa ITGB3 Platelet membrane glycoprotein IIIa
Type:
Protein
Mol. Mass.:
87038.91
Organism:
Homo sapiens (Human)
Description:
P05106
Residue:
788
  
Component 2
Name:
Integrin alpha-IIb
Synonyms:
CD_antigen=CD41 GPIIb Glycoprotein IIb ITGA2B Integrin alpha-IIb heavy chain Integrin alpha-IIb light chain, form 2 Integrin alpha-V/beta-3 and alpha-IIb/beta 3 | Platelet membrane glycoprotein IIb
Type:
Protein
Mol. Mass.:
113354.85
Organism:
Homo sapiens (Human)
Description:
P08514
Residue:
1039
  
Inhibitor
Name:
BDBM50035970
Synonyms:
3-(8-Guanidino-octanoylamino)-N-[2-(4-methoxy-phenyl)-ethyl]-succinamic acid SC-47643
Type:
Small organic molecule
Emp. Form.:
C22H35N5O5
Mol. Mass.:
449.5438
SMILES:
COc1ccc(CCNC(=O)C(CC(O)=O)NC(=O)CCCCCCCNC(N)=N)cc1
: