Target
Neprilysin
Ligand
BDBM50035243
Substrate
Meas. Tech.
ChEMBL_144456 (CHEMBL755103)
IC50
170±n/a nM
Citation
 Bihovsky, RLevinson, BLLoewi, RCErhardt, PWPolokoff, MA Hydroxamic acids as potent inhibitors of endothelin-converting enzyme from human bronchiolar smooth muscle. J Med Chem 38:2119-29 (1995)  
Target
Name:
Neprilysin
Synonyms:
Atriopeptidase CD_antigen=CD10 MME NEP_RABIT Neutral endopeptidase 24.11
Type:
Enzyme
Mol. Mass.:
85570.75
Organism:
Oryctolagus cuniculus (rabbit)
Description:
NEP was purified to homogeneity from rabbit kidney.
Residue:
750
  
Inhibitor
Name:
BDBM50035243
Synonyms:
2-(2-Hydroxycarbamoylmethyl-3-methyl-butyrylamino)-succinamic acid | CHEMBL67348
Type:
Small organic molecule
Emp. Form.:
C11H19N3O6
Mol. Mass.:
289.2851
SMILES:
CC(C)C(CC(=O)NO)C(=O)NC(CC(N)=O)C(O)=O
: