Target
Neprilysin
Ligand
BDBM50035250
Substrate
Meas. Tech.
ChEMBL_144456 (CHEMBL755103)
IC50
30±n/a nM
Citation
 Bihovsky, RLevinson, BLLoewi, RCErhardt, PWPolokoff, MA Hydroxamic acids as potent inhibitors of endothelin-converting enzyme from human bronchiolar smooth muscle. J Med Chem 38:2119-29 (1995)  
Target
Name:
Neprilysin
Synonyms:
Atriopeptidase CD_antigen=CD10 MME NEP_RABIT Neutral endopeptidase 24.11
Type:
Enzyme
Mol. Mass.:
85570.75
Organism:
Oryctolagus cuniculus (rabbit)
Description:
NEP was purified to homogeneity from rabbit kidney.
Residue:
750
  
Inhibitor
Name:
BDBM50035250
Synonyms:
3-(2-Hydroxycarbamoylmethyl-3-methyl-butyrylamino)-propionic acid | CHEMBL69793
Type:
Small organic molecule
Emp. Form.:
C10H18N2O5
Mol. Mass.:
246.2603
SMILES:
CC(C)C(CC(=O)NO)C(=O)NCCC(O)=O
: