Target
Neprilysin
Ligand
BDBM50035237
Substrate
Meas. Tech.
ChEMBL_144457 (CHEMBL755104)
IC50
30±n/a nM
Citation
 Bihovsky, RLevinson, BLLoewi, RCErhardt, PWPolokoff, MA Hydroxamic acids as potent inhibitors of endothelin-converting enzyme from human bronchiolar smooth muscle. J Med Chem 38:2119-29 (1995)  
Target
Name:
Neprilysin
Synonyms:
Atriopeptidase CD_antigen=CD10 MME NEP_RABIT Neutral endopeptidase 24.11
Type:
Enzyme
Mol. Mass.:
85570.75
Organism:
Oryctolagus cuniculus (rabbit)
Description:
NEP was purified to homogeneity from rabbit kidney.
Residue:
750
  
Inhibitor
Name:
BDBM50035237
Synonyms:
2-(2-Hydroxycarbamoylmethyl-3-methyl-butyrylamino)-3-(1H-indol-3-yl)-propionic acid | CHEMBL68128
Type:
Small organic molecule
Emp. Form.:
C18H23N3O5
Mol. Mass.:
361.3923
SMILES:
CC(C)C(CC(=O)NO)C(=O)NC(Cc1c[nH]c2ccccc12)C(O)=O
: