Target
Endothelin-converting enzyme 1
Ligand
BDBM50035243
Substrate
Meas. Tech.
ChEMBL_64355 (CHEMBL679843)
IC50
150±n/a nM
Citation
 Bihovsky, RLevinson, BLLoewi, RCErhardt, PWPolokoff, MA Hydroxamic acids as potent inhibitors of endothelin-converting enzyme from human bronchiolar smooth muscle. J Med Chem 38:2119-29 (1995)  
Target
Name:
Endothelin-converting enzyme 1
Synonyms:
ECE-1 ECE1_HUMAN Endothelin-converting enzyme 1 (ECE1)
Type:
Enzyme
Mol. Mass.:
87155.11
Organism:
Homo sapiens (Human)
Description:
P42892
Residue:
770
  
Inhibitor
Name:
BDBM50035243
Synonyms:
2-(2-Hydroxycarbamoylmethyl-3-methyl-butyrylamino)-succinamic acid | CHEMBL67348
Type:
Small organic molecule
Emp. Form.:
C11H19N3O6
Mol. Mass.:
289.2851
SMILES:
CC(C)C(CC(=O)NO)C(=O)NC(CC(N)=O)C(O)=O
: