Target
Endothelin-converting enzyme 1
Ligand
BDBM50035244
Substrate
Meas. Tech.
ChEMBL_64355 (CHEMBL679843)
IC50
500±n/a nM
Citation
 Bihovsky, RLevinson, BLLoewi, RCErhardt, PWPolokoff, MA Hydroxamic acids as potent inhibitors of endothelin-converting enzyme from human bronchiolar smooth muscle. J Med Chem 38:2119-29 (1995)  
Target
Name:
Endothelin-converting enzyme 1
Synonyms:
ECE-1 ECE1_HUMAN Endothelin-converting enzyme 1 (ECE1)
Type:
Enzyme
Mol. Mass.:
87155.11
Organism:
Homo sapiens (Human)
Description:
P42892
Residue:
770
  
Inhibitor
Name:
BDBM50035244
Synonyms:
2-(2-Hydroxyaminomethyl-3-methyl-butyrylamino)-3-(1H-indol-3-yl)-propionic acid | CHEMBL65903
Type:
Small organic molecule
Emp. Form.:
C17H23N3O4
Mol. Mass.:
333.3822
SMILES:
CC(C)C(CNO)C(=O)NC(Cc1c[nH]c2ccccc12)C(O)=O
: