Target
D(2) dopamine receptor
Ligand
BDBM50035345
Substrate
Meas. Tech.
ChEMBL_62565 (CHEMBL671496)
Ki
5.5±n/a nM
Citation
 Ennis, MDStjernlöf, PHoffman, RLGhazal, NBSmith, MWSvensson, KWikström, HHaadsma-Svensson, SRLin, CH Structure-activity relationships in the 8-amino-6,7,8,9-tetrahydro-3H-benz[e]indole ring system. 2. Effects of 8-amino nitrogen substitution on serotonin receptor binding and pharmacology. J Med Chem 38:2217-30 (1995)  
Target
Name:
D(2) dopamine receptor
Synonyms:
DOPAMINE D2 DOPAMINE D2 Short Dopamine D2 receptor Drd2
Type:
G Protein-Coupled Receptor (GPCR)
Mol. Mass.:
50931.60
Organism:
Rattus norvegicus (rat)
Description:
P61169
Residue:
444
  
Inhibitor
Name:
BDBM50035345
Synonyms:
CHEMBL71145 | Propyl-(6,7,8,9-tetrahydro-3H-benzo[e]indol-8-yl)-(2-thiophen-2-yl-ethyl)-amine
Type:
Small organic molecule
Emp. Form.:
C21H26N2S
Mol. Mass.:
338.51
SMILES:
CCCN(CCc1cccs1)C1CCc2ccc3[nH]ccc3c2C1
: