Target
5-hydroxytryptamine receptor 1D
Ligand
BDBM50035363
Substrate
Meas. Tech.
ChEMBL_2010 (CHEMBL617305)
Ki
2±n/a nM
Citation
 Ennis, MDStjernlöf, PHoffman, RLGhazal, NBSmith, MWSvensson, KWikström, HHaadsma-Svensson, SRLin, CH Structure-activity relationships in the 8-amino-6,7,8,9-tetrahydro-3H-benz[e]indole ring system. 2. Effects of 8-amino nitrogen substitution on serotonin receptor binding and pharmacology. J Med Chem 38:2217-30 (1995)  
Target
Name:
5-hydroxytryptamine receptor 1D
Synonyms:
5-HT-1D 5-HT1D 5HT1D_HUMAN HTR1DA Serotonin (5-HT) receptor | Serotonin Receptor 1D
Type:
G Protein-Coupled Receptor (GPCR)
Mol. Mass.:
41920.63
Organism:
Homo sapiens (Human)
Description:
Receptor binding assays were performed using human clone stably expressed in CHO cells.
Residue:
377
  
Inhibitor
Name:
BDBM50035363
Synonyms:
8-[Propyl-(2-thiophen-2-yl-ethyl)-amino]-6,7,8,9-tetrahydro-3H-benzo[e]indole-1-carbaldehyde | CHEMBL72062
Type:
Small organic molecule
Emp. Form.:
C22H26N2OS
Mol. Mass.:
366.52
SMILES:
CCCN(CCc1cccs1)C1CCc2ccc3[nH]cc(C=O)c3c2C1
: