Target
3-oxo-5-alpha-steroid 4-dehydrogenase 2
Ligand
BDBM50031901
Substrate
Meas. Tech.
ChEMBL_204743 (CHEMBL805436)
IC50
0.20±n/a nM
Citation
 Frye, SVHaffner, CDMaloney, PRHiner, RNDorsey, GFNoe, RAUnwalla, RJBatchelor, KWBramson, HNStuart, JD Structure-activity relationships for inhibition of type 1 and 2 human 5 alpha-reductase and human adrenal 3 beta-hydroxy-delta 5-steroid dehydrogenase/3-keto-delta 5-steroid isomerase by 6-azaandrost-4-en-3-ones: optimization of the C17 substituent. J Med Chem 38:2621-7 (1995)  
Target
Name:
3-oxo-5-alpha-steroid 4-dehydrogenase 2
Synonyms:
3-oxo-5-alpha-steroid 4-dehydrogenase 2 5α-Reductase 2 (5α-R2) SR type 2 Steroid 5-alpha-reductase Type II 5-alpha reductase
Type:
Enzyme
Mol. Mass.:
28406.59
Organism:
Homo sapiens (Human)
Description:
P31213
Residue:
254
  
Inhibitor
Name:
BDBM50031901
Synonyms:
(1S,9aR,11aS)-9a,11a-Dimethyl-7-oxo-2,3,3a,3b,4,5,7,8,9,9a,9b,10,11,11a-tetradecahydro-1H-cyclopenta[i]phenanthridine-1-carboxylic acid (3,5-bis-trifluoromethyl-phenyl)-amide | CHEMBL89240
Type:
Small organic molecule
Emp. Form.:
C27H30F6N2O2
Mol. Mass.:
528.5297
SMILES:
C[C@]12CCC3C(CN=C4CC(=O)CC[C@]34C)C1CC[C@@H]2C(=O)Nc1cc(cc(c1)C(F)(F)F)C(F)(F)F
: