Target
Sodium-dependent dopamine transporter
Ligand
BDBM50032539
Substrate
Meas. Tech.
ChEMBL_62477 (CHEMBL677369)
Ki
0.140000±n/a nM
Citation
 Kozikowski, APEddine Saiah, MKJohnson, KMBergmann, JS Chemistry and biology of the 2 beta-alkyl-3 beta-phenyl analogues of cocaine: subnanomolar affinity ligands that suggest a new pharmacophore model at the C-2 position. J Med Chem 38:3086-93 (1995)  
Target
Name:
Sodium-dependent dopamine transporter
Synonyms:
DA transporter SC6A3_RAT Sodium-dependent dopamine transporter | Sodium-dependent dopamine transporter (DAT)
Type:
Multi-pass membrane protein
Mol. Mass.:
68749.45
Organism:
Rattus norvegicus (rat)
Description:
P23977
Residue:
619
  
Inhibitor
Name:
BDBM50032539
Synonyms:
(2S,3S)-3-(4-Chloro-phenyl)-8-methyl-2-((Z)-styryl)-8-aza-bicyclo[3.2.1]octane | CHEMBL320427
Type:
Small organic molecule
Emp. Form.:
C22H24ClN
Mol. Mass.:
337.886
SMILES:
CN1C2CCC1[C@@H](\C=C/c1ccccc1)[C@H](C2)c1ccc(Cl)cc1
: