Target
3-oxo-5-alpha-steroid 4-dehydrogenase 2
Ligand
BDBM50032795
Substrate
Meas. Tech.
ChEMBL_204740 (CHEMBL805433)
IC50
0.40±n/a nM
Citation
 Bakshi, RKRasmusson, GHPatel, GFMosley, RTChang, BEllsworth, KHarris, GSTolman, RL 4-Aza-3-oxo-5 alpha-androst-1-ene-17 beta-N-aryl-carboxamides as dual inhibitors of human type 1 and type 2 steroid 5 alpha-reductases. Dramatic effect of N-aryl substituents on type 1 and type 2 5 alpha-reductase inhibitory potency. J Med Chem 38:3189-92 (1995)  
Target
Name:
3-oxo-5-alpha-steroid 4-dehydrogenase 2
Synonyms:
3-oxo-5-alpha-steroid 4-dehydrogenase 2 5α-Reductase 2 (5α-R2) SR type 2 Steroid 5-alpha-reductase Type II 5-alpha reductase
Type:
Enzyme
Mol. Mass.:
28406.59
Organism:
Homo sapiens (Human)
Description:
P31213
Residue:
254
  
Inhibitor
Name:
BDBM50032795
Synonyms:
(4aR,6aS)-7-(Indole-1-carbonyl)-4a,6a-dimethyl-1,4a,4b,5,6,6a,7,8,9,9a,9b,10,11,11a-tetradecahydro-indeno[5,4-f]quinolin-2-one | CHEMBL321867
Type:
Small organic molecule
Emp. Form.:
C27H32N2O2
Mol. Mass.:
416.5552
SMILES:
C[C@]12CCC3C(CCC4NC(=O)C=C[C@]34C)C1CCC2C(=O)n1ccc2ccccc12
: