Target
D(2) dopamine receptor
Ligand
BDBM50010686
Substrate
Meas. Tech.
ChEMBL_60065 (CHEMBL671379)
Ki
1520±n/a nM
Citation
 Michaelides, MRHong, YDiDomenico, SAsin, KEBritton, DRLin, CWWilliams, MShiosaki, K (5aR,11bS)-4,5,5a,6,7,11b-hexahydro-2-propyl-3-thia-5-azacyclopent-1- ena[c]-phenanthrene-9,10-diol (A-86929): a potent and selective dopamine D1 agonist that maintains behavioral efficacy following repeated administration and characterization of its diacetyl prodrug (ABT-431). J Med Chem 38:3445-7 (1995)  
Target
Name:
D(2) dopamine receptor
Synonyms:
D(2) dopamine receptor DOPAMINE D2 Long DRD2 Dopamine D2 receptor Dopamine D2 receptor (D2R) Dopamine2-like | d2
Type:
Cell-surface receptors
Mol. Mass.:
50647.10
Organism:
Homo sapiens (Human)
Description:
P14416
Residue:
443
  
Inhibitor
Name:
BDBM50010686
Synonyms:
(6aR,12bS)-10,11-Dihydroxy-5,6,6a,7,8,12b-hexahydro-benzo[a]phenanthridinium 10,11-Dihydroxy-5,6,6a,7,8,12b-hexahydro-benzo[a]phenanthridinium(DHX) CHEMBL25856 | dihydrexidine
Type:
Small organic molecule
Emp. Form.:
C17H17NO2
Mol. Mass.:
267.3224
SMILES:
Oc1cc2CC[C@H]3NCc4ccccc4[C@@H]3c2cc1O
: