Target
Melanocyte-stimulating hormone receptor
Ligand
BDBM50033134
Substrate
Meas. Tech.
ChEMBL_105858 (CHEMBL717328)
EC50
0.039000±n/a nM
Citation
 Hruby, VJLu, DSharma, SDCastrucci, ALKesterson, RAal-Obeidi, FAHadley, MECone, RD Cyclic lactam alpha-melanotropin analogues of Ac-Nle4-cyclo[Asp5, D-Phe7,Lys10] alpha-melanocyte-stimulating hormone-(4-10)-NH2 with bulky aromatic amino acids at position 7 show high antagonist potency and selectivity at specific melanocortin receptors. J Med Chem 38:3454-61 (1995)  
Target
Name:
Melanocyte-stimulating hormone receptor
Synonyms:
MC1-R Mc1r Melanocyte-stimulating hormone receptor | Msh-r
Type:
PROTEIN
Mol. Mass.:
35238.60
Organism:
Mus musculus
Description:
ChEMBL_1498846
Residue:
315
  
Inhibitor
Name:
BDBM50033134
Synonyms:
(3R,6S,9R,12S,15S,23R)-15-((S)-2-Acetylamino-hexanoylamino)-6-(3-guanidino-propyl)-12-(3H-imidazol-4-ylmethyl)-3-(1H-indol-3-ylmethyl)-9-naphthalen-2-ylmethyl-2,5,8,11,14,17-hexaoxo-1,4,7,10,13,18hexaaza-cyclotricosane-23-carboxylic acid amide CHEMBL266417
Type:
Small organic molecule
Emp. Form.:
C54H71N15O9
Mol. Mass.:
1074.2366
SMILES:
CCCC[C@H](NC(C)=O)C(=O)N[C@H]1CC(=O)NCCCC[C@@H](NC(=O)[C@@H](Cc2c[nH]c3ccccc23)NC(=O)[C@H](CCCNC(N)=N)NC(=O)[C@@H](Cc2ccc3ccccc3c2)NC(=O)[C@H](Cc2cnc[nH]2)NC1=O)C(N)=O
: