Target
Muscarinic acetylcholine receptor M1
Ligand
BDBM50033162
Substrate
Meas. Tech.
ChEMBL_138811 (CHEMBL747492)
IC50
0.70±n/a nM
Citation
 Ward, JSMerritt, LCalligaro, DOBymaster, FPShannon, HESawyer, BDMitch, CHDeeter, JBPeters, SCSheardown, MJ Functionally selective M1 muscarinic agonists. 3. Side chains and azacycles contributing to functional muscarinic selectivity among pyrazinylazacycles. J Med Chem 38:3469-81 (1995)  
Target
Name:
Muscarinic acetylcholine receptor M1
Synonyms:
ACM1_RAT Chrm-1 cholinergic receptor, muscarinic 1
Type:
Enzyme Catalytic Domain
Mol. Mass.:
51390.46
Organism:
RAT
Description:
P08482
Residue:
460
  
Inhibitor
Name:
BDBM50033162
Synonyms:
3-(3-Pentylsulfanyl-pyrazin-2-yl)-1-aza-bicyclo[2.2.2]octane | CHEMBL331805
Type:
Small organic molecule
Emp. Form.:
C16H25N3S
Mol. Mass.:
291.455
SMILES:
CCCCCSc1nccnc1C1CN2CCC1CC2
: