Target
Acetylcholinesterase
Ligand
BDBM50033504
Substrate
Meas. Tech.
ChEMBL_29234 (CHEMBL641883)
IC50
18180±n/a nM
Citation
 Fink, DMBores, GMEffland, RCHuger, FPKurys, BERush, DKSelk, DE Synthesis and evaluation of 5-amino-5,6,7,8-tetrahydroquinolinones as potential agents for the treatment of Alzheimer's disease. J Med Chem 38:3645-51 (1995)  
Target
Name:
Acetylcholinesterase
Synonyms:
ACES_RAT Acetylcholinesterase and butyrylcholinesterase (AChE and BChE) Acetylcholinesterase, AChE | Ache
Type:
Enzyme
Mol. Mass.:
68193.62
Organism:
Rattus norvegicus (rat)
Description:
P37136
Residue:
614
  
Inhibitor
Name:
BDBM50033504
Synonyms:
1-Methyl-5-(2-p-tolyl-ethylamino)-5,6,7,8-tetrahydro-1H-quinolin-2-one | CHEMBL121232
Type:
Small organic molecule
Emp. Form.:
C19H24N2O
Mol. Mass.:
296.4067
SMILES:
Cc1ccc(CCNC2CCCc3c2ccc(=O)n3C)cc1
: