Target
Alpha-1B adrenergic receptor
Ligand
BDBM50030615
Substrate
Meas. Tech.
ChEMBL_34343 (CHEMBL649156)
Ki
15±n/a nM
Citation
 Ruffolo, RRBondinell, WHieble, JP Alpha- and beta-adrenoceptors: from the gene to the clinic. 2. Structure-activity relationships and therapeutic applications. J Med Chem 38:3681-716 (1995)  
Target
Name:
Alpha-1B adrenergic receptor
Synonyms:
ADA1B_HUMAN Adrenergic alpha1B Adrenergic receptor alpha Alpha 1B-adrenoreceptor | Alpha-1B adrenergic receptor
Type:
Enzyme
Mol. Mass.:
56862.13
Organism:
Homo sapiens (Human)
Description:
P35368
Residue:
520
  
Inhibitor
Name:
BDBM50030615
Synonyms:
5-Chloro-1-ethyl-8-methyl-6,7,8,9-tetrahydro-2-thia-8-aza-benzo[cd]azulene SK&F-106686 | SK-106686
Type:
Small organic molecule
Emp. Form.:
C14H16ClNS
Mol. Mass.:
265.802
SMILES:
CCc1sc2ccc(Cl)c3CCN(C)Cc1c23
: