Target
Glyceraldehyde-3-phosphate dehydrogenase
Ligand
BDBM50030962
Substrate
Meas. Tech.
ChEMBL_72881 (CHEMBL684049)
IC50
400000±n/a nM
Citation
 Van Calenbergh, SVerlinde, CLSoenens, JDe Bruyn, ACallens, MBlaton, NMPeeters, OMRozenski, JHol, WGHerdewijn, P Synthesis and structure-activity relationships of analogs of 2'-deoxy-2'-(3-methoxybenzamido)adenosine, a selective inhibitor of trypanosomal glycosomal glyceraldehyde-3-phosphate dehydrogenase. J Med Chem 38:3838-49 (1995)  
Target
Name:
Glyceraldehyde-3-phosphate dehydrogenase
Synonyms:
G3P_HUMAN GAPDH glyceraldehyde-3-phosphate dehydrogenase
Type:
PROTEIN
Mol. Mass.:
36060.86
Organism:
Homo sapiens (Human)
Description:
ChEMBL_1511315
Residue:
335
  
Inhibitor
Name:
BDBM50030962
Synonyms:
CHEMBL125685 | N-[2-(6-Amino-purin-9-yl)-4-hydroxy-5-hydroxymethyl-tetrahydro-furan-3-yl]-3-ethoxy-benzamide
Type:
Small organic molecule
Emp. Form.:
C19H22N6O5
Mol. Mass.:
414.4152
SMILES:
CCOc1cccc(c1)C(=O)NC1C(O)C(CO)OC1n1cnc2c(N)ncnc12
: