Target
Transporter
Ligand
BDBM50035729
Substrate
Meas. Tech.
ChEMBL_142944 (CHEMBL750796)
IC50
60±n/a nM
Citation
 Carroll, FIKotian, PDehghani, AGray, JLKuzemko, MAParham, KAAbraham, PLewin, AHBoja, JWKuhar, MJ Cocaine and 3 beta-(4'-substituted phenyl)tropane-2 beta-carboxylic acid ester and amide analogues. New high-affinity and selective compounds for the dopamine transporter. J Med Chem 38:379-88 (1995)  
Target
Name:
Transporter
Synonyms:
Monoamine transporters; Norepininephrine & dopamine | Norepinephrine Monoamine transporters
Type:
PROTEIN
Mol. Mass.:
66787.87
Organism:
Rattus norvegicus
Description:
ChEMBL_1463061
Residue:
597
  
Inhibitor
Name:
BDBM50035729
Synonyms:
8-Methyl-3-p-tolyl-8-aza-bicyclo[3.2.1]octane CHEMBL82027
Type:
Small organic molecule
Emp. Form.:
C17H23NO2
Mol. Mass.:
273.37
SMILES:
COC(=O)C1C2CCC(CC1c1ccc(C)cc1)N2C
: