Target
Sodium-dependent serotonin transporter
Ligand
BDBM50035729
Substrate
Meas. Tech.
ChEMBL_202127 (CHEMBL882265)
Ki
19±n/a nM
Citation
 Carroll, FIKotian, PDehghani, AGray, JLKuzemko, MAParham, KAAbraham, PLewin, AHBoja, JWKuhar, MJ Cocaine and 3 beta-(4'-substituted phenyl)tropane-2 beta-carboxylic acid ester and amide analogues. New high-affinity and selective compounds for the dopamine transporter. J Med Chem 38:379-88 (1995)  
Target
Name:
Sodium-dependent serotonin transporter
Synonyms:
5-HT Transporter 5HT transporter Anandamid membrane transporter, AMT Monoamine transporters; Norepinephrine & serotonin Slc6a4 Sodium-dependent serotonin transporter (SERT) | imipramine receptor
Type:
Multi-pass membrane protein
Mol. Mass.:
70168.43
Organism:
Rattus norvegicus (rat)
Description:
P31652
Residue:
630
  
Inhibitor
Name:
BDBM50035729
Synonyms:
8-Methyl-3-p-tolyl-8-aza-bicyclo[3.2.1]octane CHEMBL82027
Type:
Small organic molecule
Emp. Form.:
C17H23NO2
Mol. Mass.:
273.37
SMILES:
COC(=O)C1C2CCC(CC1c1ccc(C)cc1)N2C
: