Target
Prostaglandin G/H synthase 1
Ligand
BDBM50031081
Substrate
Meas. Tech.
ChEMBL_159411 (CHEMBL764147)
IC50
580000±n/a nM
Citation
 Wilkerson, WWCopeland, RACovington, MTrzaskos, JM Antiinflammatory 4,5-diarylpyrroles. 2. Activity as a function of cyclooxygenase-2 inhibition. J Med Chem 38:3895-901 (1995)  
Target
Name:
Prostaglandin G/H synthase 1
Synonyms:
COX1 Cyclooxygenase-1 (COX-1) PTGS1 | Prostaglandin G/H synthase (cyclooxygenase)
Type:
Protein
Mol. Mass.:
68868.60
Organism:
Ovis aries (Sheep)
Description:
Residue:
600
  
Inhibitor
Name:
BDBM50031081
Synonyms:
2,2,2-Trifluoro-1-[4-(4-fluoro-phenyl)-5-(4-methanesulfonyl-phenyl)-1H-pyrrol-2-yl]-ethanone | CHEMBL127642
Type:
Small organic molecule
Emp. Form.:
C19H13F4NO3S
Mol. Mass.:
411.37
SMILES:
CS(=O)(=O)c1ccc(cc1)-c1[nH]c(cc1-c1ccc(F)cc1)C(=O)C(F)(F)F
: