Target
Prostaglandin G/H synthase 2
Ligand
BDBM50031086
Substrate
Meas. Tech.
ChEMBL_159929 (CHEMBL769654)
IC50
300000±n/a nM
Citation
 Wilkerson, WWCopeland, RACovington, MTrzaskos, JM Antiinflammatory 4,5-diarylpyrroles. 2. Activity as a function of cyclooxygenase-2 inhibition. J Med Chem 38:3895-901 (1995)  
Target
Name:
Prostaglandin G/H synthase 2
Synonyms:
COX2 Cyclooxygenase 2 (COX-2) Cyclooxygenase-2 (COX-2 AA) Cyclooxygenase-2 (COX-2) PGH2_HUMAN PHS II Prostaglandin E synthase/G/H synthase 2 Prostaglandin-endoperoxide synthase 2
Type:
Enzyme
Mol. Mass.:
69003.89
Organism:
Homo sapiens (Human)
Description:
Recombinant Cox-2 provided by Cayman (Cayman Chemical Co.,Ann Arbor, MI).
Residue:
604
  
Inhibitor
Name:
BDBM50031086
Synonyms:
1-[5-Bromo-3-(4-fluoro-phenyl)-2-(4-methanesulfonyl-phenyl)-pyrrol-1-yl]-ethanone | CHEMBL126808
Type:
Small organic molecule
Emp. Form.:
C19H15BrFNO3S
Mol. Mass.:
436.295
SMILES:
CC(=O)n1c(Br)cc(c1-c1ccc(cc1)S(C)(=O)=O)-c1ccc(F)cc1
: