Target
Muscarinic acetylcholine receptor M1
Ligand
BDBM50450592
Substrate
Meas. Tech.
ChEMBL_138932 (CHEMBL746581)
Kd
0.320000±n/a nM
Citation
 McPherson, DWLambert, CRJahn, KSood, VMcRee, RCZeeberg, BReba, RCKnapp, FF Resolution and in vitro and initial in vivo evaluation of isomers of iodine-125-labeled 1-azabicyclo[2.2.2]oct-3-yl alpha-hydroxy-alpha-(1-iodo-1-propen-3-yl)-alpha-phenylacetate: a high-affinity ligand for the muscarinic receptor. J Med Chem 38:3908-17 (1995)  
Target
Name:
Muscarinic acetylcholine receptor M1
Synonyms:
ACM1_RAT Chrm-1 cholinergic receptor, muscarinic 1
Type:
Enzyme Catalytic Domain
Mol. Mass.:
51390.46
Organism:
RAT
Description:
P08482
Residue:
460
  
Inhibitor
Name:
BDBM50450592
Synonyms:
CHEMBL558910
Type:
Small organic molecule
Emp. Form.:
C21H23NO3
Mol. Mass.:
337.4122
SMILES:
OC(C(=O)O[C@H]1CN2CCC1CC2)(c1ccccc1)c1ccccc1
: