Target
5-hydroxytryptamine receptor 1A
Ligand
BDBM50029255
Substrate
Meas. Tech.
ChEMBL_1143 (CHEMBL616088)
Ki
12±n/a nM
Citation
 Scott, MKBaxter, EWBennett, DJBoyd, REBlum, PSCodd, EEKukla, MJMalloy, EMaryanoff, BEMaryanoff, CA Piperazinylalkyl heterocycles as potential antipsychotic agents. J Med Chem 38:4198-210 (1995)  
Target
Name:
5-hydroxytryptamine receptor 1A
Synonyms:
5-HT-1A 5-HT1A 5-hydroxytryptamine receptor 1A (5HT1A) 5ht1a Htr1a Serotonin 1a (5-HT1a) receptor/Adrenergic receptor alpha-1 | Serotonin receptor 1A
Type:
G Protein-Coupled Receptor (GPCR)
Mol. Mass.:
46445.29
Organism:
Rattus norvegicus (rat)
Description:
Binding assays were performed using rat hippocampal membranes.
Residue:
422
  
Inhibitor
Name:
BDBM50029255
Synonyms:
1-Azepan-1-yl-2-(5-{2-[4-(2-isopropoxy-phenyl)-piperazin-1-yl]-ethyl}-1-methyl-1H-pyrrol-2-yl)-ethane-1,2-dione;succinate
Type:
Small organic molecule
Emp. Form.:
C28H40N4O3
Mol. Mass.:
480.6422
SMILES:
CC(C)Oc1ccccc1N1CCN(CCc2ccc(C(=O)C(=O)N3CCCCCC3)n2C)CC1
: