Target
D(2) dopamine receptor
Ligand
BDBM50029297
Substrate
Meas. Tech.
ChEMBL_63038 (CHEMBL678341)
Ki
5±n/a nM
Citation
 Reitz, ABBaxter, EWBennett, DJCodd, EEJordan, ADMalloy, EAMaryanoff, BEMcDonnell, MEOrtegon, MERenzi, MJ N-aryl-N'-benzylpiperazines as potential antipsychotic agents. J Med Chem 38:4211-22 (1995)  
Target
Name:
D(2) dopamine receptor
Synonyms:
DOPAMINE D2 DOPAMINE D2 Short Dopamine D2 receptor Drd2
Type:
G Protein-Coupled Receptor (GPCR)
Mol. Mass.:
50931.60
Organism:
Rattus norvegicus (rat)
Description:
P61169
Residue:
444
  
Inhibitor
Name:
BDBM50029297
Synonyms:
CHEMBL135135 | {3-[4-(2-Isopropoxy-phenyl)-piperazin-1-ylmethyl]-phenyl}-phenyl-methanol
Type:
Small organic molecule
Emp. Form.:
C27H32N2O2
Mol. Mass.:
416.5552
SMILES:
CC(C)Oc1ccccc1N1CCN(Cc2cccc(c2)C(O)c2ccccc2)CC1
: