Target
5-hydroxytryptamine receptor 1A
Ligand
BDBM50029314
Substrate
Meas. Tech.
ChEMBL_1435 (CHEMBL616308)
Ki
12±n/a nM
Citation
 Reitz, ABBaxter, EWBennett, DJCodd, EEJordan, ADMalloy, EAMaryanoff, BEMcDonnell, MEOrtegon, MERenzi, MJ N-aryl-N'-benzylpiperazines as potential antipsychotic agents. J Med Chem 38:4211-22 (1995)  
Target
Name:
5-hydroxytryptamine receptor 1A
Synonyms:
5-HT-1A 5-HT1A 5-hydroxytryptamine receptor 1A (5HT1A) 5ht1a Htr1a Serotonin 1a (5-HT1a) receptor/Adrenergic receptor alpha-1 | Serotonin receptor 1A
Type:
G Protein-Coupled Receptor (GPCR)
Mol. Mass.:
46445.29
Organism:
Rattus norvegicus (rat)
Description:
Binding assays were performed using rat hippocampal membranes.
Residue:
422
  
Inhibitor
Name:
BDBM50029314
Synonyms:
1-{3-[4-(2-Isopropoxy-phenyl)-piperazin-1-ylmethyl]-benzyl}-imidazolidine-2,4-dione | CHEMBL135938
Type:
Small organic molecule
Emp. Form.:
C24H30N4O3
Mol. Mass.:
422.52
SMILES:
CC(C)Oc1ccccc1N1CCN(Cc2cccc(Cn3cc(O)[nH]c3=O)c2)CC1
: