Target
D(2) dopamine receptor
Ligand
BDBM50029322
Substrate
Meas. Tech.
ChEMBL_63038 (CHEMBL678341)
Ki
32±n/a nM
Citation
 Reitz, ABBaxter, EWBennett, DJCodd, EEJordan, ADMalloy, EAMaryanoff, BEMcDonnell, MEOrtegon, MERenzi, MJ N-aryl-N'-benzylpiperazines as potential antipsychotic agents. J Med Chem 38:4211-22 (1995)  
Target
Name:
D(2) dopamine receptor
Synonyms:
DOPAMINE D2 DOPAMINE D2 Short Dopamine D2 receptor Drd2
Type:
G Protein-Coupled Receptor (GPCR)
Mol. Mass.:
50931.60
Organism:
Rattus norvegicus (rat)
Description:
P61169
Residue:
444
  
Inhibitor
Name:
BDBM50029322
Synonyms:
Butyl-{4-[4-(2-isopropoxy-phenyl)-piperazin-1-ylmethyl]-benzyl}-amine with malleic acid
Type:
Small organic molecule
Emp. Form.:
C25H37N3O
Mol. Mass.:
395.5808
SMILES:
CCCCNCc1ccc(CN2CCN(CC2)c2ccccc2OC(C)C)cc1
: