Target
Acetylcholinesterase
Ligand
BDBM9409
Substrate
Meas. Tech.
ChEMBL_28910 (CHEMBL638608)
IC50
0.60±n/a nM
Citation
 Sugimoto, HIimura, YYamanishi, YYamatsu, K Synthesis and structure-activity relationships of acetylcholinesterase inhibitors: 1-benzyl-4-[(5,6-dimethoxy-1-oxoindan-2-yl)methyl]piperidine hydrochloride and related compounds. J Med Chem 38:4821-9 (1996)  
Target
Name:
Acetylcholinesterase
Synonyms:
ACES_MOUSE Acetylcholinesterase (mouse AChE) Ache
Type:
Enzyme
Mol. Mass.:
68165.65
Organism:
Mus musculus (mouse)
Description:
Residue:
614
  
Inhibitor
Name:
BDBM9409
Synonyms:
CHEMBL299708 N-[2-(1-benzylpiperidin-4-yl)ethyl]-N-methyl-4-(phenylmethane)sulfonylbenzamide hydrochloride | Piperidine Derivative 21
Type:
Small organic molecule
Emp. Form.:
C29H34N2O3S
Mol. Mass.:
490.657
SMILES:
CN(CCC1CCN(Cc2ccccc2)CC1)C(=O)c1ccc(cc1)S(=O)(=O)Cc1ccccc1
: