Target
Progesterone receptor
Ligand
BDBM50148732
Substrate
Meas. Tech.
ChEMBL_159371 (CHEMBL768145)
IC50
3.2±n/a nM
Citation
 Combs, DWReese, KCornelius, LAGunnet, JWCryan, EVGranger, KSJordan, JJDemarest, KT Nonsteroidal progesterone receptor ligands. 2. High-affinity ligands with selectivity for bone cell progesterone receptors. J Med Chem 38:4880-4 (1996)  
Target
Name:
Progesterone receptor
Synonyms:
NR3C3 PGR PRGR_HUMAN | progesterone
Type:
Protein
Mol. Mass.:
98979.52
Organism:
Homo sapiens (Human)
Description:
P06401
Residue:
933
  
Inhibitor
Name:
BDBM50148732
Synonyms:
17-ethynyl-17beta-hydroxyestr-4-en-3-one 17alpha-ethinylestra-4-en-17beta-ol-3-one 17beta-hydroxy-19-norpregn-4-en-20-yn-3-one 19-Norethisterone 4-estren-17alpha-ethynyl-17beta-ol-3-one Micronor Norethisteron norethisterone
Type:
Small organic molecule
Emp. Form.:
C20H26O2
Mol. Mass.:
298.4192
SMILES:
C[C@]12CC[C@H]3[C@@H](CCC4=CC(=O)CC[C@H]34)[C@@H]1CC[C@@]2(O)C#C
: