Target
D(3) dopamine receptor
Ligand
BDBM50001884
Substrate
Meas. Tech.
ChEMBL_61949 (CHEMBL671349)
Ki
466±n/a nM
Citation
 Thurkauf, AYuan, JChen, XWasley, JWMeade, RWoodruff, KHHuston, KRoss, PC 1-Phenyl-3-(aminomethyl)pyrroles as potential antipsychotic agents. Synthesis and dopamine receptor binding. J Med Chem 38:4950-2 (1996)  
Target
Name:
D(3) dopamine receptor
Synonyms:
DRD3 | DRD3_CHLAE
Type:
PROTEIN
Mol. Mass.:
44355.59
Organism:
Chlorocebus aethiops
Description:
ChEMBL_105569
Residue:
400
  
Inhibitor
Name:
BDBM50001884
Synonyms:
2-[4-(4-Methyl-benzyl)-piperazin-1-yl]-1-(2-methyl-2,3-dihydro-indol-1-yl)-ethanone 3-chloro-6-(4-methyl-piperazin-1-yl)-5H-dibenzo[b,e][1,4]diazepine 8-Chloro-11-(4-methyl-piperazin-1-yl)-5H-dibenzo[b,e][1,4]diazepine( Clozepine ) 8-Chloro-11-(4-methyl-piperazin-1-yl)-5H-dibenzo[b,e][1,4]diazepine(Clopazine) 8-chloro-11-(4-methylpiperazin-1-yl)-5H-dibenzo[b,e][1,4]diazepine CHEMBL538973 CLOZAPINE, 8-CHLORO-11-(4-METHYL-PIPERAZIN-1-YL)-5H-DIBENZO[B,E][1,4]DIAZEPINE HF 1854 US10752588, Compound Clozapine | US11498896, Compound Clozapine
Type:
Small organic molecule
Emp. Form.:
C18H19ClN4
Mol. Mass.:
326.823
SMILES:
CN1CCN(CC1)C1=Nc2cc(Cl)ccc2Nc2ccccc12
: