Target
D(2) dopamine receptor
Ligand
BDBM50048238
Substrate
Meas. Tech.
ChEMBL_59154 (CHEMBL671035)
Ki
151±n/a nM
Citation
 Thurkauf, AYuan, JChen, XWasley, JWMeade, RWoodruff, KHHuston, KRoss, PC 1-Phenyl-3-(aminomethyl)pyrroles as potential antipsychotic agents. Synthesis and dopamine receptor binding. J Med Chem 38:4950-2 (1996)  
Target
Name:
D(2) dopamine receptor
Synonyms:
DRD2 Dopamine D2 receptor
Type:
PROTEIN
Mol. Mass.:
50619.11
Organism:
Cercopithecus aethiops
Description:
ChEMBL_59156
Residue:
443
  
Inhibitor
Name:
BDBM50048238
Synonyms:
4-(4-Chloro-phenyl)-1-(1-phenyl-1H-pyrrol-3-ylmethyl)-piperidin-4-ol | CHEMBL147003
Type:
Small organic molecule
Emp. Form.:
C22H23ClN2O
Mol. Mass.:
366.884
SMILES:
OC1(CCN(Cc2ccn(c2)-c2ccccc2)CC1)c1ccc(Cl)cc1
: