Target
D(3) dopamine receptor
Ligand
BDBM50048237
Substrate
Meas. Tech.
ChEMBL_61949 (CHEMBL671349)
Ki
15±n/a nM
Citation
 Thurkauf, AYuan, JChen, XWasley, JWMeade, RWoodruff, KHHuston, KRoss, PC 1-Phenyl-3-(aminomethyl)pyrroles as potential antipsychotic agents. Synthesis and dopamine receptor binding. J Med Chem 38:4950-2 (1996)  
Target
Name:
D(3) dopamine receptor
Synonyms:
DRD3 | DRD3_CHLAE
Type:
PROTEIN
Mol. Mass.:
44355.59
Organism:
Chlorocebus aethiops
Description:
ChEMBL_105569
Residue:
400
  
Inhibitor
Name:
BDBM50048237
Synonyms:
4-Phenyl-1-(1-phenyl-1H-pyrrol-3-ylmethyl)-1,2,3,6-tetrahydro-pyridine | CHEMBL147731
Type:
Small organic molecule
Emp. Form.:
C22H22N2
Mol. Mass.:
314.4235
SMILES:
C(N1CCC(=CC1)c1ccccc1)c1ccn(c1)-c1ccccc1
: